BDBM50101351 (S)-3-Methyl-2-(4-sulfamoyl-benzoylamino)-butyric acid::CHEMBL51586
SMILES CC(C)[C@H](NC(=O)c1ccc(cc1)S(N)(=O)=O)C(O)=O
InChI Key InChIKey=YDBPGLRNWGSMCO-JTQLQIEISA-N
Data  3 KI  1 Kd
  Tab Delimited (TSV)   2D SDfile   Computed 3D by Vconf -m prep SDfile
Find this compound or compounds like it in BindingDB:
Activity Spreadsheet -- Enzyme Inhibition Constant Data from BindingDB
Found 1 hit for monomerid = 50101351
TargetCarbonic anhydrase 1(Homo sapiens (Human))
Universit£
Curated by ChEMBL
LigandPNGBDBM50101351((S)-3-Methyl-2-(4-sulfamoyl-benzoylamino)-butyric ...)
Affinity DataKi:  420nM. Assay description: Binding affinity against human carbonic anhydrase I (hCA I)
In DepthDetails ArticlePubMed